{"text_format":"1","workbook":"xlsx","n_sheets":4,"sheets":["Contratistas","Instrucciones","Formato de Causación","Lista de Chequeo"],"not_rendered":{"charts":0,"images":3,"macros":1,"external_links":0,"defined_names":1,"comments":0,"pivot_tables":0},"unopened":[],"bounds":{"document_bytes":16777216,"sheet_cells":100000,"rows_first":2000,"rows_last":500,"rows_between":2000,"halvings":0,"cell_chars":16384,"cell_head_chars":4096},"cells_cut":0,"cells_raw":0,"read":"whole","date_system":"1900"}

{"sheet":"Contratistas","index":0,"n_rows":3616,"n_cols":2,"rows_kept":3616,"cut":false,"hidden":true,"merged":[]}
["DOC_CONTRATISTA","CONTRATISTA"]
[14563,"LUIS EMIRO VALENCIA SANCHEZ"]
[334469,"MIGUEL ANGEL VARGAS HERNANDEZ"]
[404525,"ELMER DANIEL RAMIREZ RAMIREZ"]
[659175,"CRISTHY MAIRENE VIERA TORTOZA"]
[1593098,"NERLY PEREA FLOREZ"]
[2230529,"DISRAELI LABRADOR FORERO       "]
[2940619,"JOAQUIN ALVARO FLOREZ BERNAL"]
[2971257,"CARDOSO PUENTES OSCAR AUGUSTO"]
[3002612,"JAIME GOMEZ CAMACHO"]
[3069296,"JOSE DE JESUS ZAMBRANO AVELLANEDA"]
[3077415,"PEDRO JULIO MAHECHA AVILA"]
[3081246,"JOSE MANUEL MAHECHA MAHECHA"]
[3087150,"ALEJANDRO CESPEDES AROCA"]
[3106413,"EDGAR JUVENAL RAMIREZ PEREZ"]
[3132436,"DALTON EMILIO PEREA LUNA"]
[3226959,"NELSON MUÑOZ PARDO"]
[3244416,"ALBERTO MARTINEZ MORAES"]
[3249841,"BEJARANO LUIS HERNANDO "]
[3351764,"JAVIER OMAR RUIZ ARROYAVE"]
[3839584,"JOSE VALENTIN CASTILLO CONTRERAS     "]
[4121211,"CASTILLO ECHEVERRY FRANCISCO JAVIER"]
[4149107,"RAUL EDUARDO ROMERO TOLOZA"]
[4190630,"JULIO CESAR VASQUEZ HIGUERA"]
[4191642,"AVILA PULIDO JAIME ADALBERTO"]
[4216587,"JOSUE FRANCISCO BARRERA AVELLA"]
[4229130,"ECK MANUEL IGNACIO RIVERA ALDANA"]
[4461053,"GABRIEL ARTURO WASORNA ARCE"]
[4513548,"JULIAN ANDRES ANGARITA BETANCUR     "]
[4597995,"JOSE ARLEY MINA CARDONA       "]
[4684518,"CARLOS ANTONIO VIDAL ANGULO      "]
[4752354,"CABRERA CORTEZ ELMER "]
[4825199,"PRESENTACION MOSQUERA MOSQUERA     "]
[4826453,"GLAUCOR ENRIQUE DIAZ ARBOLEDA"]
[4832984,"ARISTARCO URRUTIA MOSQUERA"]
[4884303,"RODRIGO CHARRY "]
[5107833,"ESPELETA GAZCON RUBEN DARIO"]
[5165478,"JORGE ALFREDO VERGARA BRITO"]
[5174143,"RODRIGUEZ BALLESTEROS CARLOS HERNANDO"]
[5291253,"ARIEL ROSEBEL PALACIOS ANGULO"]
[5338076,"FERNANDO RIASCOS GUERRERO"]
[5764873,"CAMPO ANIBAL CRUZ MARTINEZ"]
[5820510,"ALCAZAR MANRIQUE JUAN GUILLERMO"]
[5821973,"LEMNY GENARO LEZAMA ESPINOSA"]
[5822356,"OSCAR ANDRES ROSAS PAEZ"]
[5824835,"MAURICIO ANDRES SANCHEZ MORA"]
[5828321,"WILSON RODRIGUEZ YATE"]
[5831620,"RICAURTE TARQUINO BECERRA"]
[5864293,"JOSE WILLIAM BARRERO LOZANO"]
[5882208,"MACLOVIO POLANIA GONZALEZ"]
[5893199,"GUILLERMO SANCHEZ PRIETO"]
[5924348,"JOSE OTONIEL VALENCIA CARDONA"]
[5946109,"EDUARDO SALAZAR HERNANDEZ"]
[5946316,"CESAREO GALVEZ PERDOMO       "]
[5964220,"ARISTOBULO BARRIOS CHICO "]
[5969462,"ALPE MORENO EDGAR "]
[5970161,"JOSE GUILLERMO LOZANO GALINDO"]
[5972087,"JHON EDWIN MACIAS SANCHEZ"]
[5976178,"PEDRO ANTONIO BOCANEGRA ZABALA"]
[5976183,"GONGORA REINOSO HUGO ALFONSO"]
[5976257,"BOCANEGRA ZABALA JULIO HERNAN"]
[5977153,"ABDONIAS VERA CABRERA"]
[5978088,"JOSE RENE ORTIZ GOMEZ"]
[5978841,"MAXIMILIANO RODRIGUEZ SANCHEZ"]
[6008669,"ARIAS GONZALEZ JOSE LEONARDO"]
[6013439,"CRUZ ALONSO JOSE GEFERSON"]
[6021441,"ARCESIO VELEZ GARZON"]
[6228346,"JHON JAIRO HURTADO OCORO"]
[6246442,"WILSON LEONARDO REYES MONTOYA"]
[6437630,"EDGAR ALBERTO MARMOLEJO ACERO"]
[6769306,"HENRY ATANASIO MUÑOZ PRIETO "]
[6773359,"WINSTON GONZALEZ GALINDO       "]
[6816697,"MENEVAL BITAR CORENA"]
[6820705,"RUGERO ENRIQUE LARA GONZALEZ"]
[6868022,"JOSE LUIS SIMANCA RAMIREZ       "]
[7142793,"ARBELAEZ BATEMAN ORLANDO JOSE"]
[7166551,"MARCOS JAVIER CARVAJAL GOMEZ      "]
[7168416,"NELSON ADOLFO BARRERA RODRIGUEZ"]
[7168454,"GIAN CARLO SUESCUN SANABRIA"]
[7177139,"ALBERT ONELL OSPINO AYALA"]
[7215064,"MARIO FROILAN REYES BECERRA"]
[7301764,"LEMUS MURCIA OMAR ALIRIO"]
[7305331,"FABIO HUMBERTO CORTES SANCHEZ"]
[7318258,"JUAN DIEGO DELGADILLO PAEZ"]
[7420311,"ROBERTO ROMERO OSPINA"]
[7465944,"JOSE ANGEL PERNETT CASTILLO      "]
[7523068,"CARLOS ALBERTO GARCIA OVIEDO"]
[7721981,"EDER PAOLO GARCIA VEGA"]
[7728825,"BLADIMIR TOLEDO CARDOZO"]
[7882852,"ROBBY DANIEL RODRIGUEZ PEREZ      "]
[7919817,"JAVIER ALFONSO VELASQUEZ MOLINA"]
[7997044,"ALFONSO PEDROZO AYALA       "]
[8028368,"EDGAR HERNAN FUENTES CONTRERAS"]
[8128811,"CASTRO TORO FERNANDO "]
[8248778,"CARLOS ARTURO MONTOYA SALAZAR"]
[8424870,"LUIS ROBERTO ARBOLEDA MURILLO"]
[8567902,"REYES CARO RICARDO SENEN"]
[8675735,"NORBERTO CAÑATE VALDES"]
[8694817,"GOMEZ BALLESTAS JAIRO ENRIQUE"]
[8697259,"ALFONSO ROMAN CERA POLO"]
[8775084,"EDGARDO JESUS DONADO MEZA"]
[9066851,"MARINO DE JESUS SIERRA OTERO"]
[9077459,"FREDDY GULFO MARTINEZ       "]
[9086064,"GERMAN DE JESUS OCHOA MESA      "]
[9152765,"NARCISO TORRES PEREZ        "]
[9155674,"HERRERA BELEÑO WILMER "]
[9520849,"ABDON CELY ANGEL"]
[9522778,"LUIS VICENTE MARTINEZ VALERO"]
[9527296,"CARO PUENTES PEDRO JULIO"]
[9772684,"LUIS FELIPE PEREZ LOPEZ"]
[9867577,"JULIAN ALBERTO VASQUEZ GRAJALES"]
[10131996,"JAIRO DE JESUS CHICAMA "]
[10169904,"JORGE FAJARDO AVILA"]
[10189589,"GARCIA CARDENAS JULIAN MAURICIO"]
[10273049,"DUQUE ESCOBAR EDUARDO "]
[10300828,"FABIAN ESTEBAN OROZCO SOLANO"]
[10472514,"GEIBER TRUJILLO LUCUMI"]
[10517885,"CAMILO GONZALEZ POSSO"]
[10518115,"BERNARDO ALFONSO ORTEGA CAMPO"]
[10528748,"LUIS FELIX CUATINDOY GUERRERO      "]
{"$rows_left_out":3497}
{"sheet":"Instrucciones","index":1,"n_rows":8,"n_cols":1,"rows_kept":8,"cut":false,"hidden":false,"merged":[]}
["Instrucciones:"]
[]
["1. Los campos resaltados en color verdese deben diligenciar con carácter obligatorio."]
["2. Si el campo Contratista, no se diligencia automáticamente al diligenciar el campo C.C., se debe diligenciar la celda L12"]
["3. Los campos Aporte Voluntario a Pensión, Ahorro Fomento Construcción, Medicina Prepagada, Intereses de Vivienda y Dependientes, "]
["    son de diligenciamiento opcional dependiendo de la documentación soporte que alleguen los contratistas."]
["4. Los campos relacionados bajo la Celda \"Cuenta\" se deben diligenciar conforme a las cuentas a afectar"]
["5. Se imprime el Formato  haciendo click en la imagen de la impresora"]

{"sheet":"Formato de Causación","index":2,"n_rows":130,"n_cols":28,"rows_kept":130,"cut":false,"hidden":false,"merged":[[70,1,70,10],[61,8,61,9],[62,8,62,9],[63,8,63,9],[64,8,64,9],[66,8,66,9],[67,8,67,9],[58,7,62,7],[60,8,60,9],[59,8,59,9],[65,8,65,9],[58,3,58,5],[58,8,58,9],[1,10,2,10],[16,6,16,7],[16,2,16,5],[9,1,9,10],[7,1,7,2],[13,1,13,2],[14,1,14,2],[13,5,13,7],[14,6,14,7],[15,6,15,7],[7,5,7,7],[57,17,57,18],[32,14,32,15],[34,14,34,15],[34,12,34,13],[33,12,33,13],[13,15,13,16],[49,1,49,2],[49,6,49,7],[43,1,43,10],[51,2,51,5],[51,6,51,7],[50,6,50,7],[47,4,47,5],[48,5,48,7],[48,1,48,2],[24,3,24,5],[23,7,26,7],[26,8,26,9],[25,8,25,9],[23,8,23,9],[24,8,24,9],[31,8,31,9],[10,12,10,14],[11,12,11,14],[28,8,28,9],[29,8,29,9],[30,8,30,9],[27,8,27,9],[13,12,13,13],[20,9,20,10],[21,9,21,10]]}
[null,{"$f":"((I17-SUM(K24:K25))*0.4)","v":0},false,null,null,null,null,null,null,false,false]
[null,null,null,null,null,null,null,null,null,null,"Imprimir Causación"]
[null,null,null,null,null,null,null,null,null,null,null,5.2199999999999998E-3]
[null,null,null,null,null,null,null,null,null,null,null,1.044E-2]
[null,null,null,null,null,null,null,null,null,null,null,2.436E-2]
[null,null,null,null,null,null,null,null,null,null,null,4.3499999999999997E-2]
[null,null,null,null,null,null,null,null,null,null,5.0000000000000001E-3,6.9599999999999995E-2]
[null,"ARTICULO 383",null,null,null,"Declara Renta",null,null,null,null,0.02]
[null,null,null,null,null,null,null,null,null,null,null,null,"UVT","Salario Mínimo","Base en UVT"]
[null,"FORMATO DE CAUSACION PRESTACION DE SERVICIOS",null,null,null,null,null,null,null,null,null,null,31859,737717,{"$f":"+F26/M10","v":0}]
[null,null,null,null,null,null,null,null,null,null,null,null,"Nombre Contratista Opcional"]
[]
[null,"Regimen Común",null,"Pensionado*",null,"Ingreso para IBC"]
[null,"No. CONTRATO Y VIGENCIA",null,"IBC ","SALUD","PENSION",null,null,"DIAS","ARL","Proyecto de Inversión / Rubro",null,"RANGO UVT",null,"%","RANGO VALORES"]
[null,null,null,{"$f":"IF(A23=TRUE,(I17*0.4),(IF(AND((I17*0.4)<N10,I17>0),N10,I17*0.4)))","v":0},0.125,0.16,0.17,null,null,null,null,null,"DESDE","HASTA",null,"DESDE","HASTA"]
[null,"C.C.",null,null,{"$f":"+D15*E15","v":0},{"$f":"IF(J1=TRUE,0,IF(D15<($N$10*4),D15*F15,0))","v":0},{"$f":"IF(J1=TRUE,0,IF(D15>(($N$10*4)-1),D15*G15,0))","v":0},null,null,{"$f":"ROUND((I17*0.4)*J15,-2)","v":0},null,null,0,95,0,0,{"$f":"+M10*N16","v":3026605}]
[null,"CONTRATISTA",{"$f":"IFERROR(VLOOKUP(C16,Contratistas!$A$1:$B$3616,2,0),IF(ISBLANK(M12)=TRUE,\"\",M12))","v":""},null,null,null,"Ingreso Bruto",null,{"$f":"IF(C1=TRUE,((C19/30)*I15)-C21,(C19/30*I15))","v":0},null,null,null,95,150,0.19,{"$f":"+M10*M17","v":3026605},{"$f":"+M10*N17","v":4778850}]
[null,null,null,null,null,null,null,null,null,null,null,null,150,360,0.28000000000000003,{"$f":"+M10*M18","v":4778850},{"$f":"+M10*N18","v":11469240}]
[null,"VR. MENSUALIDAD",null,null,null,null,null,null,null,"Fecha Inicio",null,null,360,1000,0.33,{"$f":"+M10*M19","v":11469240},0]
[null,"VR. ANTES DE IVA",{"$f":"IF(C1=FALSE,\"\",((C19/30)*I15)/1.19)","v":""},null,null,null,null,null,null,"Fecha Term."]
[null,"VR. IVA",{"$f":"IF(C1=FALSE,\"\",IF(C1=TRUE,((C19/30)*I15)-((C19/30)*I15)/1.19,(C19/30*I15)))","v":""},null,null,null,null,null,"Período"]
[]
[false]
["NOMBRE CUENTA","CODIGO CUENTA","DEBITO","CREDITO","% RETENCION","BASE",null,"Aportes Obligatorios y Voluntarios","Salud",null,{"$f":"+E16","v":0}]
["Honorarios Inversión",{"$f":"IFERROR(VLOOKUP(A25,A36:B41,2,0),\"\")","v":52110901},{"$f":"IF(C1=TRUE,C21+I17,I17)","v":0},null,null,null,null,null,"Pensión",null,{"$f":"IF(J1=TRUE,0,(F16+G16))","v":0}]
["Retefuente Servicios",24361502,null,{"$f":"IF((IF(O10<M19,IF(O10<M18,IF(O10<M17,0,((O10-N16)*O17)*M10),(((O10-M18)*O18)+10)*M10),(((O10-M19)*O19)+69)*M10))<0,0,IF(O10<M19,IF(O10<M18,IF(O10<M17,0,((O10-N16)*O17)*M10),(((O10-M18)*O18)+10)*M10),(((O10-M19)*O19)+69)*M10))","v":0},{"$f":"VLOOKUP(O10,M14:O19,3,1)","v":0},{"$f":"IF((I17-K32)<0,0,IF(SUM(K26:K31)<B1,(I17-K32),I17-B1-K24-K25))","v":0},null,null,"Aporte Voluntario a Pensión",null,null,"Monto Máximo a deducir en AFC"]
["ReteIVA",243625,null,{"$f":"IFERROR(E27*F27,0)","v":0},0.15,{"$f":"+C21","v":""},null,null,"Ahorro Fomento Construcción",null,null,{"$f":"(I17*0.3)-K26","v":0}]
["ReteICA",243627,null,{"$f":"+F28*E28","v":0},9.6600000000000002E-3,{"$f":"IF((I17-K24-K25)<0,0,I17-K24-K25)","v":0},null,"Otros Aportes Salud","Medicina Prepagada - Seguros\nComplementarios"]
["Estampilla Universidad Distrital",24369001,null,{"$f":"+F29*E29","v":0},0.01,{"$f":"I17","v":0},null,"Intereses","Intereses de Vivienda",null,null,"Monto Máximo a deducir en Dependientes"]
["Estampilla Pro Cultura",24369002,null,{"$f":"+F30*E30","v":0},5.0000000000000001E-3,{"$f":"I17","v":0},null,null,"Dependientes",null,null,{"$f":"IF(I17*0.1<M10*32,I17*0.1,M10*32)","v":0}]
["Estampilla Pro Adulto Mayor",24369003,null,{"$f":"+F31*E31","v":0},0.02,{"$f":"I17","v":0},null,null,"Deducciones por Renta Exenta",null,{"$f":"IF((I17-SUM(K23:K29))*0.25<240*M10,((I17-SUM(K23:K29))*0.25),M10*240)","v":0}]
["Cuentas por Pagar Honorarios",242552,null,{"$f":"+C25-D26-D27-D28-D29-D30-D31","v":0},null,null,null,null,"Total Deducciones",null,{"$f":"SUM(K24:K31)","v":0}]
[]
[null,null,null,null,null,null,null,null,null,"CONTABILIZA:"]
["* Aplica para pensionado o no obligado a cotizar pensión",null,null,"GCO-GCI-F068 VERSION 1 VIGENCIA: 30 de noviembre de 2017"]
[]
["Honorarios Inversión",52110901]
["Honorarios Funcionamiento",51111102]
["Servicios",51111103]
["Gastos de Administración - P. Ant",581588]
["Gastos de Operación - P. Ant",581589]
[]
[null,null,null,null,null,null,null,null,null,null,null,null,null,"Base en UVT"]
[null,null,null,null,null,null,null,null,null,null,null,null,null,{"$f":"+F60/M10","v":0}]
[]
[null,null,null,null,null,null,null,null,null,null,null,null,"Desde","Hasta","Impuesto en UVT"]
[null,null,null,null,null,null,null,null,null,null,null,null,0,128.96,0]
[null,null,null,null,null,null,null,null,null,null,null,null,{"$f":"+N47","v":128.96},132.36000000000001,0.09]
[null,null,null,null,null,null,null,null,null,null,null,null,132.36000000000001,135.75,0.09]
[null,null,null,null,null,null,null,null,null,null,null,null,135.75,139.13999999999999,0.09]
[null,null,null,null,null,null,null,null,null,null,null,null,139.13999999999999,142.54,0.09]
[null,null,null,null,null,null,null,null,null,null,null,null,142.54,145.93,0.1]
[null,null,null,null,null,null,null,null,null,null,null,null,145.93,149.32,0.2]
[null,null,null,null,null,null,null,null,null,null,null,null,149.32,152.72,0.2]
[null,null,null,null,null,null,null,null,null,null,null,null,152.72,156.11000000000001,0.21]
[null,null,null,null,null,null,null,null,null,null,null,null,156.11000000000001,159.51,0.4]
[null,null,null,null,null,null,null,null,null,null,null,null,159.51,162.9,0.41]
[null,null,null,null,null,null,null,null,null,null,null,null,162.9,166.29,0.41,null,null,null,null,null,null,null,null,null,null,null,null,{"$f":"VLOOKUP(N44,M46:O130,3,1)","v":0}]
[null,null,null,null,null,null,null,null,null,null,null,null,166.29,169.69,0.7]
[null,null,null,null,null,null,null,null,null,null,null,null,169.69,176.47,0.73]
[null,null,null,null,null,null,null,null,null,null,null,null,176.47,183.26,1.1499999999999999]
[null,null,null,null,null,null,null,null,null,null,null,null,183.26,190.05,1.19]
[null,null,null,null,null,null,null,null,null,null,null,null,{"$f":"+N62","v":190.05},196.84,1.65]
[null,null,null,null,null,null,null,null,null,null,null,null,{"$f":"+N63","v":196.84},203.62,2.14,null,null,null,{"$f":"+O50*M10","v":2867.31}]
[null,null,null,null,null,null,null,null,null,null,null,null,203.62,210.41,2.21]
[null,null,null,null,null,null,null,null,null,null,null,null,210.41,217.2,2.96]
[null,null,null,null,null,null,null,null,null,null,null,null,217.2,230.77,3.87]
[null,null,null,null,null,null,null,null,null,null,null,null,230.77,237.56,4.63]
[null,null,null,null,null,null,null,null,null,null,null,null,{"$f":"+N68","v":237.56},244.35,5.0599999999999996]
[null,null,null,null,null,null,null,null,null,null,null,null,244.35,257.92,5.96]
[null,null,null,null,null,null,null,null,null,null,null,null,257.92,264.70999999999998,6.44]
[null,null,null,null,null,null,null,null,null,null,null,null,264.70999999999998,271.5,6.93]
[null,null,null,null,null,null,null,null,null,null,null,null,271.5,278.29000000000002,7.44]
[null,null,null,null,null,null,null,null,null,null,null,null,{"$f":"+N73","v":278.29000000000002},285.07,7.96]
[null,null,null,null,null,null,null,null,null,null,null,null,285.07,291.86,8.5]
[null,null,null,null,null,null,null,null,null,null,null,null,291.86,298.64999999999998,9.0500000000000007]
[null,null,null,null,null,null,null,null,null,null,null,null,298.64999999999998,305.44,9.6199999999999992]
[null,null,null,null,null,null,null,null,null,null,null,null,305.44,312.22000000000003,10.210000000000001]
[null,null,null,null,null,null,null,null,null,null,null,null,312.22000000000003,319.01,10.81]
[null,null,null,null,null,null,null,null,null,null,null,null,319.01,325.8,11.43]
[null,null,null,null,null,null,null,null,null,null,null,null,{"$f":"+N80","v":325.8},332.59,12.07]
[null,null,null,null,null,null,null,null,null,null,null,null,332.59,339.37,12.71]
[null,null,null,null,null,null,null,null,null,null,null,null,339.37,356.34,14.06]
[null,null,null,null,null,null,null,null,null,null,null,null,356.34,373.31,15.83]
[null,null,null,null,null,null,null,null,null,null,null,null,373.31,390.28,17.690000000000001]
[null,null,null,null,null,null,null,null,null,null,null,null,390.28,407.25,19.649999999999999]
[null,null,null,null,null,null,null,null,null,null,null,null,407.25,424.22,21.69]
[null,null,null,null,null,null,null,null,null,null,null,null,424.22,441.19,23.84]
[null,null,null,null,null,null,null,null,null,null,null,null,441.19,458.16,26.07]
[null,null,null,null,null,null,null,null,null,null,null,null,458.16,475.12,28.39]
[null,null,null,null,null,null,null,null,null,null,null,null,475.12,492.09,30.8]
[null,null,null,null,null,null,null,null,null,null,null,null,492.09,509.06,33.29]
[null,null,null,null,null,null,null,null,null,null,null,null,509.06,526.03,35.869999999999997]
[null,null,null,null,null,null,null,null,null,null,null,null,526.03,543,38.54]
[null,null,null,null,null,null,null,null,null,null,null,null,543,559.97,41.29]
[null,null,null,null,null,null,null,null,null,null,null,null,559.97,576.94000000000005,44.11]
[null,null,null,null,null,null,null,null,null,null,null,null,576.94000000000005,593.9,47.02]
[null,null,null,null,null,null,null,null,null,null,null,null,593.9,610.87,50]
[null,null,null,null,null,null,null,null,null,null,null,null,610.87,627.84,53.06]
[null,null,null,null,null,null,null,null,null,null,null,null,627.84,644.80999999999995,56.2]
[null,null,null,null,null,null,null,null,null,null,null,null,644.80999999999995,661.78,59.4]
[null,null,null,null,null,null,null,null,null,null,null,null,661.78,678.75,62.68]
[null,null,null,null,null,null,null,null,null,null,null,null,678.75,695.72,66.02]
[null,null,null,null,null,null,null,null,null,null,null,null,695.72,712.69,69.430000000000007]
[null,null,null,null,null,null,null,null,null,null,null,null,712.69,729.65,72.900000000000006]
[null,null,null,null,null,null,null,null,null,null,null,null,729.65,746.62,76.430000000000007]
[null,null,null,null,null,null,null,null,null,null,null,null,746.62,763.59,80.03]
[null,null,null,null,null,null,null,null,null,null,null,null,763.59,780.56,83.68]
[null,null,null,null,null,null,null,null,null,null,null,null,780.56,797.53,87.39]
[null,null,null,null,null,null,null,null,null,null,null,null,797.53,814.5,91.15]
[null,null,null,null,null,null,null,null,null,null,null,null,814.5,831.47,94.96]
[null,null,null,null,null,null,null,null,null,null,null,null,831.47,848.44,98.81]
[null,null,null,null,null,null,null,null,null,null,null,null,848.44,865.4,102.72]
[null,null,null,null,null,null,null,null,null,null,null,null,865.4,882.37,106.67]
[null,null,null,null,null,null,null,null,null,null,null,null,882.37,899.34,110.65]
[null,null,null,null,null,null,null,null,null,null,null,null,899.34,916.31,114.68]
[null,null,null,null,null,null,null,null,null,null,null,null,916.31,933.28,118.74]
[null,null,null,null,null,null,null,null,null,null,null,null,933.28,950.25,122.84]
[null,null,null,null,null,null,null,null,null,null,null,null,950.25,967.22,126.96]
[null,null,null,null,null,null,null,null,null,null,null,null,967.22,984.19,131.11000000000001]
{"$rows_left_out":11}
{"sheet":"Lista de Chequeo","index":3,"n_rows":37,"n_cols":13,"rows_kept":37,"cut":false,"hidden":false,"merged":[[14,1,14,7],[14,10,14,12],[20,10,20,12],[27,10,27,12],[23,1,23,7],[23,10,23,12],[24,1,24,7],[24,10,24,12],[25,1,25,7],[25,10,25,12],[26,1,26,7],[26,10,26,12],[15,1,15,7],[15,10,15,12],[16,1,16,7],[16,10,16,12],[11,10,11,12],[12,1,12,7],[12,10,12,12],[13,1,13,7],[13,10,13,12],[11,1,11,7],[18,10,18,12],[22,1,22,7],[22,10,22,12],[17,1,17,7],[17,10,17,12],[18,1,18,7],[21,1,21,7],[21,10,21,12],[19,1,19,7],[19,10,19,12],[20,1,20,7],[10,1,10,7],[10,10,10,12],[6,10,6,11],[4,0,4,12],[8,8,8,9],[9,1,9,7],[9,10,9,12]]}
[]
[]
[]
[]
["PROCESO GESTIÓN Y ADQUISICIÓN DE RECURSOS \nFormato Lista de Chequeo de Soportes para Pago"]
[]
["Contrato Nº:",null,{"$f":"'Formato de Causación'!B15","v":0},"Beneficiario:",null,{"$f":"+'Formato de Causación'!C17","v":""},null,null,null,"Periodo:",{"$f":"IF(ISBLANK('Formato de Causación'!J21),\" \",'Formato de Causación'!J21)","v":" "},null,{"$f":"IF(ISBLANK('Formato de Causación'!J22),\" \",'Formato de Causación'!J22)","v":" "}]
["Dependencia:"]
[null,null,null,null,null,null,null,null,"Adjunta"]
["Documentos Básicos","Descripción",null,null,null,null,null,null,"Si","No","Observación"]
[1,"Formato de Causación"]
[2,"Certificación de cumplimiento o acta de recibo a satisfacción"]
[3,"Acta de inicio (si es primer pago)"]
[4,"Informe de actividades y soportes"]
[5,"Pago de aportes de seguridad social o Certificado de parafiscales persona jurídica"]
[6,"Resolución de pensión o recibo de pago de pensión y/o carta donde manifieste que nunca ha cotizado pensión (para mayores de 55 años)"]
[7,"Factura o Cuenta de cobro (si aplica)"]
[8,"Certificación bancaria (si es primer pago)"]
[9,"Certificación Calidad Tributaria del Contratista (Certificación Cedular)"]
[10,"Certificación de cuenta AFC y Carta autorización de descuento del pago"]
[11,"Certificación de cuenta aportes voluntarios pensión y carta solicitando el descuento"]
[12,"Certificación de intereses de vivienda pagados a 31 de diciembre del año anterior"]
[13,"Certificación de pagos a medicina prepagada a 31 de diciembre del año anterior"]
[14,"Formato de dependientes y Soportes"]
[15,"Copia de la minuta de adición, cesión, suspensión o terminación anticipada"]
[16,"Acta de liquidación y/o informe final del interventor"]
[17,"Control de retiro (si es ultimo pago)"]
[]
[]
["     Revisión Contabilidad",null,null,null,null,"          Revisión Giros",null,null,null,null,null,"      Revisión Gestión Documental"]
["     Firma",null,null,null,null,"          Firma",null,null,null,"  Orden de Pago Nº",null,"  Firma"]
["     Nombre:",{"$f":"+'Formato de Causación'!K34","v":0},null,null,null,"          Nombre:",null,null,null,null,null,"  Nombre:"]
["     Nº de Documentos Básicos:",null,null,null,null,"          Nº de Documentos Básicos:",null,null,null,null,null,"  Nº de Documentos Básicos: *"]
["     Fecha de diligenciamiento:",null,null,null,null,"          Fecha de recibido Giros:"]
[]
[]
["* La diferencia se relaciona con el documento orden de pago"]